Use redox_syscall 0.2.10.

5 jobs for manual_redox_tls in 1 minute and 7 seconds (queued for 2 seconds)
Status Name Job ID Coverage
  Build
failed build:linux #33437

00:01:07

failed build:redox #33438

00:00:46

 
  Test
failed fmt #33441

00:00:33

skipped test:linux #33439
skipped test:redox #33440
allowed to fail
 
Name Stage Failure
failed
fmt Test
+    //fn dlrealloc(oldmem: *mut c_void, bytes: size_t) -> *mut c_void;
+ //fn dlfree(mem: *mut c_void);
}

pub struct Allocator {
Warning: Unknown configuration option `fn_args_density`
Warning: the `merge_imports` option is deprecated. Use `imports_granularity=Crate` instead
Cleaning up file based variables
ERROR: Job failed: exit code 1
failed
build:redox Build
: "/root/.redoxer/toolchain/lib/rustlib/src/rust/Cargo.lock" does not exist, unable to build with the standard library, try:
rustup component add rust-src
make: *** [Makefile:183: "target/x86_64-unknown-redox"/release/crt0.o] Error 101
make: *** [Makefile:195: "target/x86_64-unknown-redox"/release/ld_so.o] Error 101
error: "/root/.redoxer/toolchain/lib/rustlib/src/rust/Cargo.lock" does not exist, unable to build with the standard library, try:
rustup component add rust-src
make: *** [Makefile:178: "target/x86_64-unknown-redox"/release/librelibc.a] Error 101
Cleaning up file based variables
ERROR: Job failed: exit code 1
failed
build:linux Build
make: *** Waiting for unfinished jobs....
make: *** [Makefile:191: "target/x86_64-unknown-linux-gnu"/release/crtn.o] Error 101
make: *** [Makefile:195: "target/x86_64-unknown-linux-gnu"/release/ld_so.o] Error 101
make: *** [Makefile:183: "target/x86_64-unknown-linux-gnu"/release/crt0.o] Error 101
error: "/root/.rustup/toolchains/nightly-2021-06-15-x86_64-unknown-linux-gnu/lib/rustlib/src/rust/Cargo.lock" does not exist, unable to build with the standard library, try:
rustup component add rust-src
make: *** [Makefile:178: "target/x86_64-unknown-linux-gnu"/release/librelibc.a] Error 101
Cleaning up file based variables
ERROR: Job failed: exit code 1