allow calling shebang scripts in PATH

5 jobs for master in 4 minutes and 55 seconds (queued for 2 seconds)
latest
Status Job ID Name Coverage
  Build
passed #29937
build:linux

00:02:57

passed #29938
build:redox

00:02:47

 
  Test
failed #29941
allowed to fail
fmt

00:00:42

passed #29939
test:linux

00:00:50

failed #29940
allowed to fail
test:redox

00:02:07

 
Name Stage Failure
failed
test:redox Test
Installing package ca-certificates
* Requesting https://static.redox-os.org/pkg/x86_64-unknown-redox/ca-certificates.sig
* Failure 404 Not Found
thread 'main' panicked at 'called `Result::unwrap()` on an `Err` value: Custom { kind: NotFound, error: "https://static.redox-os.org/pkg/x86_64-unknown-redox/ca-certificates.sig not found" }', /root/.cargo/registry/src/github.com-1ecc6299db9ec823/redox_installer-0.2.7/src/lib.rs:124:38
note: run with `RUST_BACKTRACE=1` environment variable to display a backtrace
make[1]: *** [Makefile:180: verify] Error 101
make: *** [Makefile:99: test] Error 2
make[1]: Leaving directory '/builds/aaronjanse/relibc/tests'
ERROR: Job failed: exit code 1
failed
fmt Test
Diff in /builds/aaronjanse/relibc/src/platform/redox/mod.rs at line 299:
return -1;
}
}
-

// Arguments
while !(*argv).is_null() {
ERROR: Job failed: exit code 1