Add direnv file

1 job from direnv in 5 minutes (queued for 1 second)
latest
Status Job ID Name Coverage
  Test
failed #12652
img

00:05:00

 
Name Stage Failure
failed
img Test
Makefile:170: recipe for target '"target/x86_64-unknown-redox"/include' failed
make[2]: *** ["target/x86_64-unknown-redox"/include] Error 101
make[2]: Leaving directory '/builds/jD91mZM2/redox/relibc'
mk/prefix.mk:36: recipe for target 'prefix/x86_64-unknown-redox/relibc-install' failed
make[1]: *** [prefix/x86_64-unknown-redox/relibc-install] Error 2
make[1]: Leaving directory '/builds/jD91mZM2/redox'
Makefile:65: recipe for target 'ci-img' failed
make: *** [ci-img] Error 2
ERROR: Job failed: exit code 1