bootstrap.sh: yacc provided by bison on Arch Linux

1 job for patch-1 in 12 minutes and 42 seconds (queued for 1 second)
latest
Status Job ID Name Coverage
  Test
failed #13812
img

00:12:42

 
Name Stage Failure
failed
img Test
make[2]: *** ["target/x86_64-unknown-redox"/include] Error 1
Makefile:170: recipe for target '"target/x86_64-unknown-redox"/include' failed
make[2]: Leaving directory '/builds/nanpuyue/redox/relibc'
mk/prefix.mk:36: recipe for target 'prefix/x86_64-unknown-redox/relibc-install' failed
make[1]: Leaving directory '/builds/nanpuyue/redox'
Makefile:65: recipe for target 'ci-img' failed
make[1]: *** [prefix/x86_64-unknown-redox/relibc-install] Error 2
make: *** [ci-img] Error 2
ERROR: Job failed: exit code 1