1 job for master in 44 minutes and 23 seconds (queued for 1 second)
Name Stage Failure
failed
img Test
Makefile:28: recipe for target 'build/bootloader' failed
make[2]: *** [build/bootloader] Error 1
make[2]: Leaving directory '/builds/redox-os/redox/bootloader-coreboot'
mk/disk.mk:32: recipe for target 'bootloader-coreboot/build/bootloader' failed
make[1]: *** [bootloader-coreboot/build/bootloader] Error 2
make[1]: Leaving directory '/builds/redox-os/redox'
Makefile:65: recipe for target 'ci-img' failed
make: *** [ci-img] Error 2
ERROR: Job failed: exit code 1