Add python

1 job for freebsd in 12 minutes and 40 seconds (queued for 1 second)
Name Stage Failure
img Test
* Failure 404 Not Found
thread 'main' panicked at 'called `Result::unwrap()` on an `Err` value: Custom { kind: NotFound, error: " not found" }', src/libcore/
note: run with `RUST_BACKTRACE=1` environment variable to display a backtrace.
make[1]: *** [build/initfs.tag] Error 101
mk/ recipe for target 'build/initfs.tag' failed
make[1]: Leaving directory '/builds/redox-os/redox'
Makefile:65: recipe for target 'ci-img' failed
make: *** [ci-img] Error 2
ERROR: Job failed: exit code 1