Update relibc

1 job for master in 9 minutes and 18 seconds (queued for 2 seconds)
Status Name Job ID Coverage
  Test
failed img #26843

00:09:18

 
Name Stage Failure
failed
img Test
make[2]: *** ["target/x86_64-unknown-redox"/release/librelibc.a] Error 101
Makefile:144: recipe for target '"target/x86_64-unknown-redox"/release/librelibc.a' failed
make[2]: Leaving directory '/builds/redox-os/redox/relibc'
mk/prefix.mk:36: recipe for target 'prefix/x86_64-unknown-redox/relibc-install' failed
make[1]: Leaving directory '/builds/redox-os/redox'
make[1]: *** [prefix/x86_64-unknown-redox/relibc-install] Error 2
Makefile:65: recipe for target 'ci-img' failed
make: *** [ci-img] Error 2
ERROR: Job failed: exit code 1