Update submodules

1 job for master in 25 minutes and 57 seconds (queued for 1 second)
Status Job ID Name Coverage
  Test
failed #20006
img

00:25:57

 
Name Stage Failure
failed
img Test
make[2]: *** [build/x86_64-efi-pe/boot.a] Error 101
Makefile:66: recipe for target 'build/x86_64-efi-pe/boot.a' failed
make[2]: Leaving directory '/builds/redox-os/redox/bootloader-efi'
mk/disk.mk:29: recipe for target 'bootloader-efi/build/x86_64-efi-pe/boot.efi' failed
make[1]: *** [bootloader-efi/build/x86_64-efi-pe/boot.efi] Error 2
make[1]: Leaving directory '/builds/redox-os/redox'
make: *** [ci-img] Error 2
Makefile:65: recipe for target 'ci-img' failed
ERROR: Job failed: exit code 1