Update rust-toolchain

6 jobs for wctype in 1 minute and 49 seconds (queued for 3 seconds)
Status Name Job ID Coverage
  Build
failed build:linux #33278

00:01:17

failed build:redox #33283

00:00:43

failed build:redox #33279

00:00:11

 
  Test
failed fmt #33282

00:01:24

skipped test:linux #33280
skipped test:redox #33281
allowed to fail
 
Name Stage Failure
failed
build:redox Build
error: "/root/.redoxer/toolchain/lib/rustlib/src/rust/Cargo.lock" does not exist, unable to build with the standard library, try:
rustup component add rust-src
make: *** [Makefile:186: "target/x86_64-unknown-redox"/release/crti.o] Error 101
error: "/root/.redoxer/toolchain/lib/rustlib/src/rust/Cargo.lock" does not exist, unable to build with the standard library, try:
rustup component add rust-src
make: *** [Makefile:194: "target/x86_64-unknown-redox"/release/ld_so.o] Error 101
make: *** [Makefile:177: "target/x86_64-unknown-redox"/release/librelibc.a] Error 101
Cleaning up file based variables
ERROR: Job failed: exit code 1
failed
fmt Test
+    255, 0, 255, 3, 255, 255, 255, 255, 255, 0, 255, 255, 255, 63, 0, 0, 0, 0, 0, 0, 0, 0, 0, 0,
+ 255, 239, 255, 255, 255, 255, 255, 255, 255, 255, 255, 255, 255, 255, 123, 252, 255, 255, 255,
+ 255, 231, 199, 255, 255, 255, 231, 255, 255, 255, 255, 255, 255, 255, 255, 255, 255, 255, 255,
+ 255, 255, 255, 255, 15, 0, 255, 63, 15, 7, 7, 0, 63, 0, 0, 0, 0, 0, 0, 0, 0, 0, 0, 0, 0, 0,
];

Warning: Unknown configuration option `fn_args_density`
Cleaning up file based variables
ERROR: Job failed: exit code 1
failed
build:linux Build
        rustup component add rust-src
error: "/root/.rustup/toolchains/nightly-2020-07-27-x86_64-unknown-linux-gnu/lib/rustlib/src/rust/Cargo.lock" does not exist, unable to build with the standard library, try:
rustup component add rust-src
make: *** [Makefile:186: "target/x86_64-unknown-linux-gnu"/release/crti.o] Error 101
make: *** [Makefile:182: "target/x86_64-unknown-linux-gnu"/release/crt0.o] Error 101
make: *** [Makefile:190: "target/x86_64-unknown-linux-gnu"/release/crtn.o] Error 101
make: *** [Makefile:194: "target/x86_64-unknown-linux-gnu"/release/ld_so.o] Error 101
Cleaning up file based variables
ERROR: Job failed: exit code 1